Target
Serine/threonine-protein kinase PLK1
Ligand
BDBM46116
Substrate
Meas. Tech.
Concentration Response fluorescence polarization-based assay to test PMLSC Chemistry Core synthesized analogs of confirmed hits from the Polo box domain (PBD) of Plk1 Primary HTS.
IC50
>50000±n/a nM
Citation
 PubChem, PC Concentration Response fluorescence polarization-based assay to test PMLSC Chemistry Core synthesized analogs of confirmed hits from the Polo box domain (PBD) of Plk1 Primary HTS. PubChem Bioassay (2008)[AID] 
Target
Name:
Serine/threonine-protein kinase PLK1
Synonyms:
PLK PLK1 Polo-like kinase 1 (PlK1) STPK13 Serine/threonine-protein kinase 13 | polo-like kinase
Type:
Serine/threonine-protein kinase
Mol. Mass.:
68277.16
Organism:
Homo sapiens (Human)
Description:
P53350
Residue:
603
  
Inhibitor
Name:
BDBM46116
Synonyms:
4-amino-1,3-dimethyl-2,6-dioxo-N-(phenylmethyl)-5-pyrimidinesulfonamide 4-amino-N-benzyl-2,6-diketo-1,3-dimethyl-pyrimidine-5-sulfonamide UPDDI-00398619 | cid_7197655
Type:
Small organic molecule
Emp. Form.:
C13H16N4O4S
Mol. Mass.:
324.356
SMILES:
Cn1c(N)c(c(=O)n(C)c1=O)S(=O)(=O)NCc1ccccc1
: