Target
Tyrosine-protein phosphatase non-receptor type 7
Ligand
BDBM32280
Substrate
Meas. Tech.
Fluorescent secondary assay for dose-response confirmation of chemical inhibitors of HePTP
IC50
1148±n/a nM
Citation
 PubChem, PC Fluorescent secondary assay for dose-response confirmation of chemical inhibitors of HePTP PubChem Bioassay (2009)[AID] 
Target
Name:
Tyrosine-protein phosphatase non-receptor type 7
Synonyms:
He-PTP Hematopoietic protein-tyrosine phosphatase (HEPTP) PTPN7 Tyrosine-protein phosphatase non-receptor type 7 | Tyrosine-protein phosphatase non-receptor type 7 (HEPTP)
Type:
Protein
Mol. Mass.:
40530.79
Organism:
Homo sapiens (Human)
Description:
P35236
Residue:
360
  
Inhibitor
Name:
BDBM32280
Synonyms:
MLS000534769 N-(4-acetylphenyl)-2,3-bis(2-furyl)quinoxaline-6-carboxamide N-(4-acetylphenyl)-2,3-di-2-furyl-6-quinoxalinecarboxamide SMR000142225 | cid_1331726
Type:
Small organic molecule
Emp. Form.:
C25H17N3O4
Mol. Mass.:
423.4202
SMILES:
CC(=O)c1ccc(NC(=O)c2ccc3nc(-c4ccco4)c(nc3c2)-c2ccco2)cc1
: