Target
Heat shock cognate 71 kDa protein
Ligand
BDBM31743
Substrate
Meas. Tech.
In Vitro Hsc70 Dose Response Fluorescence Polarization Assay
IC50
112000±6100 nM
Citation
 PubChem, PC In Vitro Hsc70 Dose Response Fluorescence Polarization Assay PubChem Bioassay (2008)[AID] 
Target
Name:
Heat shock cognate 71 kDa protein
Synonyms:
HSC70 HSP7C_HUMAN HSPA8 heat shock 70kDa protein 8 isoform 2
Type:
Enzyme Catalytic Domain
Mol. Mass.:
70887.67
Organism:
Homo sapiens (Human)
Description:
gi_5729877
Residue:
646
  
Inhibitor
Name:
BDBM31743
Synonyms:
8-(2-carbethoxyphenoxy)carbonyl-3a,4,5,9b-tetrahydro-3H-cyclopenta[c]quinoline-4-carboxylic acid 8-[(2-ethoxycarbonylphenoxy)-oxomethyl]-3a,4,5,9b-tetrahydro-3H-cyclopenta[c]quinoline-4-carboxylic acid cid_2925672
Type:
Small organic molecule
Emp. Form.:
C23H21NO6
Mol. Mass.:
407.4159
SMILES:
CCOC(=O)c1ccccc1OC(=O)c1ccc2NC(C3CC=CC3c2c1)C(O)=O
: