Target
Heat shock cognate 71 kDa protein
Ligand
BDBM31747
Substrate
Meas. Tech.
In Vitro Hsc70 Dose Response Fluorescence Polarization Assay
IC50
86000±4630 nM
Citation
 PubChem, PC In Vitro Hsc70 Dose Response Fluorescence Polarization Assay PubChem Bioassay (2008)[AID] 
Target
Name:
Heat shock cognate 71 kDa protein
Synonyms:
HSC70 HSP7C_HUMAN HSPA8 heat shock 70kDa protein 8 isoform 2
Type:
Enzyme Catalytic Domain
Mol. Mass.:
70887.67
Organism:
Homo sapiens (Human)
Description:
gi_5729877
Residue:
646
  
Inhibitor
Name:
BDBM31747
Synonyms:
6-aminocarbonyl-3a,4,5,9b-tetrahydro-3H-cyclopenta[c]quinoline-4-carboxylic acid MLS-0111539.0001 | cid_2869196
Type:
Small organic molecule
Emp. Form.:
C14H14N2O3
Mol. Mass.:
258.2726
SMILES:
NC(=O)c1cccc2C3C=CCC3C(Nc12)C(O)=O
: