Target
Estrogen receptor beta
Ligand
BDBM39953
Substrate
Meas. Tech.
Estrogen Receptor (beta) binding: Dose Response of Primary Screen Assay
EC50
1.74±n/a nM
Citation
 PubChem, PC Estrogen Receptor (beta) binding: Dose Response of Primary Screen Assay PubChem Bioassay (2008)[AID] 
Target
Name:
Estrogen receptor beta
Synonyms:
ER-beta ESR2_HUMAN Estradiol receptor beta (ERβ) Estrogen receptor (ER beta) Estrogen receptor beta (ER beta) NR3A2 estrogen beta
Type:
Protein
Mol. Mass.:
59238.43
Organism:
Homo sapiens (Human)
Description:
Q92731
Residue:
530
  
Inhibitor
Name:
BDBM39953
Synonyms:
4-keto-4-(2-thienyl)butyric acid [2-(2-furfurylamino)-2-keto-ethyl] ester MLS000054585 [2-(furan-2-ylmethylamino)-2-oxidanylidene-ethyl] 4-oxidanylidene-4-thiophen-2-yl-butanoate cid_2355490
Type:
Small organic molecule
Emp. Form.:
C15H15NO5S
Mol. Mass.:
321.348
SMILES:
O=C(COC(=O)CCC(=O)c1cccs1)NCc1ccco1
: