Target
Nuclear receptor coactivator 2
Ligand
BDBM43117
Substrate
Meas. Tech.
Dose response biochemical High Throughput Screening assay for agonists of the steroid receptor coactivator 2 (SRC-2) recruitment by the peroxisome proliferator-activated receptor gamma (PPARgamma)
EC50
>79370±n/a nM
Citation
 PubChem, PC Dose response biochemical High Throughput Screening assay for agonists of the steroid receptor coactivator 2 (SRC-2) recruitment by the peroxisome proliferator-activated receptor gamma (PPARgamma) PubChem Bioassay (2008)[AID] 
Target
Name:
Nuclear receptor coactivator 2
Synonyms:
BHLHE75 NCOA2 protein SRC2 | TIF2
Type:
Enzyme Catalytic Domain
Mol. Mass.:
159156.93
Organism:
Homo sapiens (Human)
Description:
Q15596
Residue:
1464
  
Inhibitor
Name:
BDBM43117
Synonyms:
1-(3-fluorophenyl)-1-phenyl-4-(1-pyrrolidinyl)-2-butyn-1-ol 1-(3-fluorophenyl)-1-phenyl-4-pyrrolidin-1-ylbut-2-yn-1-ol MLS000663971 cid_2915585
Type:
Small organic molecule
Emp. Form.:
C20H20FNO
Mol. Mass.:
309.3773
SMILES:
OC(C#CCN1CCCC1)(c1ccccc1)c1cccc(F)c1
: