Target
Glutathione S-transferase Mu 1
Ligand
BDBM46298
Substrate
Meas. Tech.
Profiling Assay to determine GST-GSH interactions in multiplex bead-based assays (HPSMTB buffer)
EC50
26410±n/a nM
Citation
 PubChem, PC Profiling Assay to determine GST-GSH interactions in multiplex bead-based assays (HPSMTB buffer) PubChem Bioassay (2008)[AID] 
Target
Name:
Glutathione S-transferase Mu 1
Synonyms:
GST class-mu 1 GSTM1 GSTM1_HUMAN GSTM1b-1b Glutathione S-transferase Mu 1 glutathione S-transferase
Type:
PROTEIN
Mol. Mass.:
25712.03
Organism:
Homo sapiens (Human)
Description:
ChEMBL_799596
Residue:
218
  
Inhibitor
Name:
BDBM46298
Synonyms:
2-[(1,1-diketo-1,2-benzothiazol-3-yl)-[(3-methylbenzylidene)amino]amino]ethanol 2-[[1,1-bis(oxidanylidene)-1,2-benzothiazol-3-yl]-[(3-methylphenyl)methylideneamino]amino]ethanol MLS000686259 cid_4421869
Type:
Small organic molecule
Emp. Form.:
C17H17N3O3S
Mol. Mass.:
343.4
SMILES:
Cc1cccc(C=NN(CCO)C2=NS(=O)(=O)c3ccccc23)c1
: