Target
Bcl-2-like protein 10 [11-204]
Ligand
BDBM33055
Substrate
Meas. Tech.
Multiplexed high-throughput screen for small molecule regulators of Bcl-2 family protein interactions, specifically Bim-Bcl-B protein.
EC50
33800±n/a nM
Citation
 PubChem, PC Multiplexed high-throughput screen for small molecule regulators of Bcl-2 family protein interactions, specifically Bim-Bcl-B protein. PubChem Bioassay (2008)[AID] 
Target
Name:
Bcl-2-like protein 10 [11-204]
Synonyms:
Apoptosis regulator Bcl-B (Bcl-2-like 10 protein) (Bcl2-L-10) (Anti-apoptotic protein NrH). BCL-B BCLB DIVA
Type:
Enzyme Catalytic Domain
Mol. Mass.:
21981.77
Organism:
Homo sapiens (Human)
Description:
gi_23396469
Residue:
194
  
Inhibitor
Name:
BDBM33055
Synonyms:
2,3-bis(2-furanyl)-N-phenyl-6-quinoxalinecarboxamide 2,3-bis(furan-2-yl)-N-phenyl-quinoxaline-6-carboxamide 2,3-di-2-furyl-N-phenyl-6-quinoxalinecarboxamide SMR000077343 | cid_2213073
Type:
Small organic molecule
Emp. Form.:
C23H15N3O3
Mol. Mass.:
381.3835
SMILES:
O=C(Nc1ccccc1)c1ccc2nc(-c3ccco3)c(nc2c1)-c1ccco1
: