Target
Bcl-2-like protein 2
Ligand
BDBM32263
Substrate
Meas. Tech.
Multiplexed dose response screen for small molecule regulators of Bcl-2 family protein interactions, specifically Bim-Bcl-W.
EC50
7580±n/a nM
Citation
 PubChem, PC Multiplexed dose response screen for small molecule regulators of Bcl-2 family protein interactions, specifically Bim-Bcl-W. PubChem Bioassay (2008)[AID] 
Target
Name:
Bcl-2-like protein 2
Synonyms:
Apoptosis regulator Bcl-W BCL-W BCLW Bcl2-L-2 | KIAA0271
Type:
Protein
Mol. Mass.:
20742.61
Organism:
Homo sapiens (Human)
Description:
Residue:
193
  
Inhibitor
Name:
BDBM32263
Synonyms:
3-(5-methyl-1H-pyrazol-3-yl)-6-(4-phenylphenyl)-7H-[1,2,4]triazolo[3,4-b][1,3,4]thiadiazine SMR000046672 | cid_665473
Type:
Small organic molecule
Emp. Form.:
C20H16N6S
Mol. Mass.:
372.446
SMILES:
Cc1cc(n[nH]1)-c1nnc2SCC(=Nn12)c1ccc(cc1)-c1ccccc1
: