Target
Bcl-2-like protein 2
Ligand
BDBM32295
Substrate
Meas. Tech.
Multiplexed dose response screen for small molecule regulators of Bcl-2 family protein interactions, specifically Bim-Bcl-W.
EC50
15930±n/a nM
Citation
 PubChem, PC Multiplexed dose response screen for small molecule regulators of Bcl-2 family protein interactions, specifically Bim-Bcl-W. PubChem Bioassay (2008)[AID] 
Target
Name:
Bcl-2-like protein 2
Synonyms:
Apoptosis regulator Bcl-W BCL-W BCLW Bcl2-L-2 | KIAA0271
Type:
Protein
Mol. Mass.:
20742.61
Organism:
Homo sapiens (Human)
Description:
Residue:
193
  
Inhibitor
Name:
BDBM32295
Synonyms:
(5Z)-3-ethyl-5-[(2E)-2-(1-ethyl-4-quinolinylidene)ethylidene]-2-sulfanylidene-4-thiazolidinone (5Z)-3-ethyl-5-[(2E)-2-(1-ethylquinolin-4-ylidene)ethylidene]-2-sulfanylidene-1,3-thiazolidin-4-one MLS000574570 cid_1989678
Type:
Small organic molecule
Emp. Form.:
C18H18N2OS2
Mol. Mass.:
342.478
SMILES:
CCN1C(=S)S\C(=C/C=C2\C=CN(CC)c3ccccc23)C1=O
: