Target
Bcl-2-like protein 2
Ligand
BDBM33172
Substrate
Meas. Tech.
Multiplexed dose response screen for small molecule regulators of Bcl-2 family protein interactions, specifically Bim-Bcl-W.
EC50
6620±n/a nM
Citation
 PubChem, PC Multiplexed dose response screen for small molecule regulators of Bcl-2 family protein interactions, specifically Bim-Bcl-W. PubChem Bioassay (2008)[AID] 
Target
Name:
Bcl-2-like protein 2
Synonyms:
Apoptosis regulator Bcl-W BCL-W BCLW Bcl2-L-2 | KIAA0271
Type:
Protein
Mol. Mass.:
20742.61
Organism:
Homo sapiens (Human)
Description:
Residue:
193
  
Inhibitor
Name:
BDBM33172
Synonyms:
2-(2-furanyl)-1H-perimidine 2-(furan-2-yl)-1H-perimidine SMR000284057 | cid_376355
Type:
Small organic molecule
Emp. Form.:
C15H10N2O
Mol. Mass.:
234.2527
SMILES:
c1coc(c1)-c1nc2cccc3cccc([nH]1)c23
: