Target
Nuclear receptor coactivator 3
Ligand
BDBM42970
Substrate
Meas. Tech.
Dose response biochemical High Throughput Screening assay for agonists of the steroid receptor coactivator 3 (SRC-3) recruitment by the peroxisome proliferator-activated receptor gamma (PPARgamma)
EC50
>79370±n/a nM
Citation
 PubChem, PC Dose response biochemical High Throughput Screening assay for agonists of the steroid receptor coactivator 3 (SRC-3) recruitment by the peroxisome proliferator-activated receptor gamma (PPARgamma) PubChem Bioassay (2008)[AID] 
Target
Name:
Nuclear receptor coactivator 3
Synonyms:
AIB1 NCOA3 RAC3 nuclear receptor coactivator 3 isoform a
Type:
Enzyme Catalytic Domain
Mol. Mass.:
155305.29
Organism:
Homo sapiens (Human)
Description:
Q9Y6Q9
Residue:
1424
  
Inhibitor
Name:
BDBM42970
Synonyms:
2-azanylidene-10-methyl-N-(2-morpholin-4-ylethyl)-5-oxidanylidene-1-(2-phenylethyl)dipyrido[3,4-c:1',2'-f]pyrimidine-3-carboxamide 2-imino-10-methyl-N-[2-(4-morpholinyl)ethyl]-5-oxo-1-(2-phenylethyl)-3-dipyrido[3,4-c:1',2'-f]pyrimidinecarboxamide MLS000113803 cid_1311835
Type:
Small organic molecule
Emp. Form.:
C27H30N6O3
Mol. Mass.:
486.5655
SMILES:
Cc1cccn2c1nc1n(CCc3ccccc3)c(=N)c(cc1c2=O)C(=O)NCCN1CCOCC1
: