Target
Nuclear receptor coactivator 3
Ligand
BDBM43033
Substrate
Meas. Tech.
Dose response biochemical High Throughput Screening assay for agonists of the steroid receptor coactivator 3 (SRC-3) recruitment by the peroxisome proliferator-activated receptor gamma (PPARgamma)
EC50
>79370±n/a nM
Citation
 PubChem, PC Dose response biochemical High Throughput Screening assay for agonists of the steroid receptor coactivator 3 (SRC-3) recruitment by the peroxisome proliferator-activated receptor gamma (PPARgamma) PubChem Bioassay (2008)[AID] 
Target
Name:
Nuclear receptor coactivator 3
Synonyms:
AIB1 NCOA3 RAC3 nuclear receptor coactivator 3 isoform a
Type:
Enzyme Catalytic Domain
Mol. Mass.:
155305.29
Organism:
Homo sapiens (Human)
Description:
Q9Y6Q9
Residue:
1424
  
Inhibitor
Name:
BDBM43033
Synonyms:
1-(4-chlorophenyl)-6-cyano-5-keto-7-(p-tolyl)-[1,2,4]triazolo[4,3-a]pyrimidine-3-carboxylic acid ethyl ester MLS000325331 cid_1234437 ethyl 1-(4-chlorophenyl)-6-cyano-7-(4-methylphenyl)-5-oxo-1,5-dihydro[1,2,4]triazolo[4,3-a]pyrimidine-3-carboxylate | ethyl 1-(4-chlorophenyl)-6-cyano-7-(4-methylphenyl)-5-oxo-[1,2,4]triazolo[4,3-a]pyrimidine-3-carboxylate
Type:
Small organic molecule
Emp. Form.:
C22H16ClN5O3
Mol. Mass.:
433.847
SMILES:
CCOC(=O)c1nn(-c2ccc(Cl)cc2)c2nc(-c3ccc(C)cc3)c(C#N)c(=O)n12
: