Target
Nuclear receptor coactivator 3
Ligand
BDBM43046
Substrate
Meas. Tech.
Dose response biochemical High Throughput Screening assay for agonists of the steroid receptor coactivator 3 (SRC-3) recruitment by the peroxisome proliferator-activated receptor gamma (PPARgamma)
EC50
>79370±n/a nM
Citation
 PubChem, PC Dose response biochemical High Throughput Screening assay for agonists of the steroid receptor coactivator 3 (SRC-3) recruitment by the peroxisome proliferator-activated receptor gamma (PPARgamma) PubChem Bioassay (2008)[AID] 
Target
Name:
Nuclear receptor coactivator 3
Synonyms:
AIB1 NCOA3 RAC3 nuclear receptor coactivator 3 isoform a
Type:
Enzyme Catalytic Domain
Mol. Mass.:
155305.29
Organism:
Homo sapiens (Human)
Description:
Q9Y6Q9
Residue:
1424
  
Inhibitor
Name:
BDBM43046
Synonyms:
2-(6-Methoxy-2-methyl-quinolin-4-ylsulfanyl)-N-(2,4,6-trimethyl-phenyl)-acetamide 2-(6-methoxy-2-methylquinolin-4-yl)sulfanyl-N-(2,4,6-trimethylphenyl)acetamide MLS000553279 SMR000177790 | cid_1143752
Type:
Small organic molecule
Emp. Form.:
C22H24N2O2S
Mol. Mass.:
380.503
SMILES:
COc1ccc2nc(C)cc(SCC(=O)Nc3c(C)cc(C)cc3C)c2c1
: