Target
Serine/threonine-protein kinase D1
Ligand
BDBM32351
Substrate
Meas. Tech.
Fluorescence polarization assay for PKD inhibitiors-interference assay-57K HTS campaign
IC50
>50000±n/a nM
Citation
 PubChem, PC Fluorescence polarization assay for PKD inhibitiors-interference assay-57K HTS campaign PubChem Bioassay (2008)[AID] 
Target
Name:
Serine/threonine-protein kinase D1
Synonyms:
KPCD1_HUMAN PKD1 PRKD1 Protein kinase C mu type Protein kinase C, PKC; classical/novel Protein kinase D (PRKD1) nPKC-D1 | nPKC-mu
Type:
Serine/threonine-protein kinase
Mol. Mass.:
101705.07
Organism:
Homo sapiens (Human)
Description:
gi_115529463
Residue:
912
  
Inhibitor
Name:
BDBM32351
Synonyms:
1-phenyl-2-[(3-pyridin-3-yl-[1,2,4]triazolo[4,3-b]pyridazin-6-yl)sulfanyl]ethanone 1-phenyl-2-[[3-(3-pyridyl)-[1,2,4]triazolo[4,3-b]pyridazin-6-yl]thio]ethanone SMR000323618 | cid_7190795
Type:
Small organic molecule
Emp. Form.:
C18H13N5OS
Mol. Mass.:
347.394
SMILES:
O=C(CSc1ccc2nnc(-c3cccnc3)n2n1)c1ccccc1
: