Target
Serine/threonine-protein kinase D1
Ligand
BDBM32355
Substrate
Meas. Tech.
Fluorescence polarization assay for PKD inhibitiors-interference assay-57K HTS campaign
IC50
>50000±n/a nM
Citation
 PubChem, PC Fluorescence polarization assay for PKD inhibitiors-interference assay-57K HTS campaign PubChem Bioassay (2008)[AID] 
Target
Name:
Serine/threonine-protein kinase D1
Synonyms:
KPCD1_HUMAN PKD1 PRKD1 Protein kinase C mu type Protein kinase C, PKC; classical/novel Protein kinase D (PRKD1) nPKC-D1 | nPKC-mu
Type:
Serine/threonine-protein kinase
Mol. Mass.:
101705.07
Organism:
Homo sapiens (Human)
Description:
gi_115529463
Residue:
912
  
Inhibitor
Name:
BDBM32355
Synonyms:
MLS000730065 N-cyclopentyl-3-(4-methoxybenzyl)-2,4-dioxo-1,2,3,4-tetrahydroquinazoline-7-carboxamide N-cyclopentyl-3-[(4-methoxyphenyl)methyl]-2,4-dioxo-1H-quinazoline-7-carboxamide cid_16195425
Type:
Small organic molecule
Emp. Form.:
C22H23N3O4
Mol. Mass.:
393.4357
SMILES:
COc1ccc(Cn2c(=O)[nH]c3cc(ccc3c2=O)C(=O)NC2CCCC2)cc1
: