Target
Serine/threonine-protein kinase D1
Ligand
BDBM32356
Substrate
Meas. Tech.
Fluorescence polarization assay for PKD inhibitiors-interference assay-57K HTS campaign
IC50
>50000±n/a nM
Citation
 PubChem, PC Fluorescence polarization assay for PKD inhibitiors-interference assay-57K HTS campaign PubChem Bioassay (2008)[AID] 
Target
Name:
Serine/threonine-protein kinase D1
Synonyms:
KPCD1_HUMAN PKD1 PRKD1 Protein kinase C mu type Protein kinase C, PKC; classical/novel Protein kinase D (PRKD1) nPKC-D1 | nPKC-mu
Type:
Serine/threonine-protein kinase
Mol. Mass.:
101705.07
Organism:
Homo sapiens (Human)
Description:
gi_115529463
Residue:
912
  
Inhibitor
Name:
BDBM32356
Synonyms:
2-amino-6-chloro-4-methyl-3,5-pyridinedicarbonitrile 2-amino-6-chloro-4-methylpyridine-3,5-dicarbonitrile MLS000692177 cid_606000
Type:
Small organic molecule
Emp. Form.:
C8H5ClN4
Mol. Mass.:
192.605
SMILES:
Cc1c(C#N)c(N)nc(Cl)c1C#N
: