Target
Signal transducer and activator of transcription 3 [702-738,740-752]
Ligand
BDBM46388
Substrate
Meas. Tech.
Dose response cell-based assay to measure STAT3 inhibition
IC50
3466±n/a nM
Citation
 PubChem, PC Dose response cell-based assay to measure STAT3 inhibition PubChem Bioassay (2008)[AID] 
Target
Name:
Signal transducer and activator of transcription 3 [702-738,740-752]
Synonyms:
APRF STAT3_HUMAN
Type:
Enzyme Catalytic Domain
Mol. Mass.:
5263.93
Organism:
Homo sapiens (Human)
Description:
gi_13272532
Residue:
50
  
Inhibitor
Name:
BDBM46388
Synonyms:
3-(4-fluorobenzyl)oxy-2-methyl-quinoline 3-[(4-fluorophenyl)methoxy]-2-methyl-quinoline MLS000547371 cid_3787931
Type:
Small organic molecule
Emp. Form.:
C17H14FNO
Mol. Mass.:
267.2976
SMILES:
Cc1nc2ccccc2cc1OCc1ccc(F)cc1
: