Target
Signal transducer and activator of transcription 3 [702-738,740-752]
Ligand
BDBM46391
Substrate
Meas. Tech.
Dose response cell-based assay to measure STAT3 inhibition
IC50
4442±n/a nM
Citation
 PubChem, PC Dose response cell-based assay to measure STAT3 inhibition PubChem Bioassay (2008)[AID] 
Target
Name:
Signal transducer and activator of transcription 3 [702-738,740-752]
Synonyms:
APRF STAT3_HUMAN
Type:
Enzyme Catalytic Domain
Mol. Mass.:
5263.93
Organism:
Homo sapiens (Human)
Description:
gi_13272532
Residue:
50
  
Inhibitor
Name:
BDBM46391
Synonyms:
2-chlorobenzoic acid [3-(4-quinazolinylamino)phenyl] ester 3-(4-quinazolinylamino)phenyl 2-chlorobenzoate SMR000196728 [3-(quinazolin-4-ylamino)phenyl] 2-chlorobenzoate | cid_1187613
Type:
Small organic molecule
Emp. Form.:
C21H14ClN3O2
Mol. Mass.:
375.808
SMILES:
Clc1ccccc1C(=O)Oc1cccc(Nc2ncnc3ccccc23)c1
: