Target
Signal transducer and activator of transcription 3 [702-738,740-752]
Ligand
BDBM46412
Substrate
Meas. Tech.
Dose response cell-based assay to measure STAT3 inhibition
IC50
6113±n/a nM
Citation
 PubChem, PC Dose response cell-based assay to measure STAT3 inhibition PubChem Bioassay (2008)[AID] 
Target
Name:
Signal transducer and activator of transcription 3 [702-738,740-752]
Synonyms:
APRF STAT3_HUMAN
Type:
Enzyme Catalytic Domain
Mol. Mass.:
5263.93
Organism:
Homo sapiens (Human)
Description:
gi_13272532
Residue:
50
  
Inhibitor
Name:
BDBM46412
Synonyms:
2-(2-naphthalenyloxy)-N-pyridin-4-ylacetamide 2-naphthalen-2-yloxy-N-pyridin-4-yl-ethanamide MLS000765153 cid_823638
Type:
Small organic molecule
Emp. Form.:
C17H14N2O2
Mol. Mass.:
278.3053
SMILES:
O=C(COc1ccc2ccccc2c1)Nc1ccncc1
: