Target
Signal transducer and activator of transcription 3 [702-738,740-752]
Ligand
BDBM46423
Substrate
Meas. Tech.
Dose response cell-based assay to measure STAT3 inhibition
IC50
1610±n/a nM
Citation
 PubChem, PC Dose response cell-based assay to measure STAT3 inhibition PubChem Bioassay (2008)[AID] 
Target
Name:
Signal transducer and activator of transcription 3 [702-738,740-752]
Synonyms:
APRF STAT3_HUMAN
Type:
Enzyme Catalytic Domain
Mol. Mass.:
5263.93
Organism:
Homo sapiens (Human)
Description:
gi_13272532
Residue:
50
  
Inhibitor
Name:
BDBM46423
Synonyms:
4-(4-benzylpiperidin-1-yl)thieno[2,3-d]pyrimidine 4-[4-(phenylmethyl)-1-piperidinyl]thieno[2,3-d]pyrimidine MLS001007458 cid_2100018
Type:
Small organic molecule
Emp. Form.:
C18H19N3S
Mol. Mass.:
309.429
SMILES:
C(C1CCN(CC1)c1ncnc2sccc12)c1ccccc1
: