Target
Signal transducer and activator of transcription 3 [702-738,740-752]
Ligand
BDBM46426
Substrate
Meas. Tech.
Dose response cell-based assay to measure STAT3 inhibition
IC50
5217±n/a nM
Citation
 PubChem, PC Dose response cell-based assay to measure STAT3 inhibition PubChem Bioassay (2008)[AID] 
Target
Name:
Signal transducer and activator of transcription 3 [702-738,740-752]
Synonyms:
APRF STAT3_HUMAN
Type:
Enzyme Catalytic Domain
Mol. Mass.:
5263.93
Organism:
Homo sapiens (Human)
Description:
gi_13272532
Residue:
50
  
Inhibitor
Name:
BDBM46426
Synonyms:
(3Z)-1-(4-benzoyl-1-pyridin-1-iumyl)-3-(1,3,3-trimethyl-2-indolylidene)-2-propanone;chloride (3Z)-1-(4-benzoylpyridin-1-ium-1-yl)-3-(1,3,3-trimethylindolin-2-ylidene)acetone;chloride MLS000770890 cid_16196204
Type:
Small organic molecule
Emp. Form.:
C26H25N2O2
Mol. Mass.:
397.4884
SMILES:
CN1C(=CC(=O)C[n+]2ccc(cc2)C(=O)c2ccccc2)C(C)(C)c2ccccc12
: