Target
Signal transducer and activator of transcription 1-alpha/beta
Ligand
BDBM42583
Substrate
Meas. Tech.
Dose response counterscreen assay for STAT3 inhibitors: cell-based high throughput assay to measure STAT1 inhibition
IC50
>55700±n/a nM
Citation
 PubChem, PC Dose response counterscreen assay for STAT3 inhibitors: cell-based high throughput assay to measure STAT1 inhibition PubChem Bioassay (2008)[AID] 
Target
Name:
Signal transducer and activator of transcription 1-alpha/beta
Synonyms:
STAT1 Signal transducer and activator of transcription 1-alpha/beta Transcription factor ISGF-3 components p91/p84 | signal transducer and activator of transcription 1 isoform alpha
Type:
Cytosolic Transcription Factor
Mol. Mass.:
87327.69
Organism:
Homo sapiens (Human)
Description:
Stat1 was expressed in sf9 cells from a baculovirus encoding the recombinant proteins. Stat1 dimer binds to DNA.
Residue:
750
  
Inhibitor
Name:
BDBM42583
Synonyms:
1-Hydroxy-7,8,9,10-tetrahydro-6H-12-thia-5a,11-diaza-cyclohepta[b]fluoren-5-one SMR000009844 | cid_534281
Type:
Small organic molecule
Emp. Form.:
C15H14N2O2S
Mol. Mass.:
286.349
SMILES:
Oc1cccc2c1sc1nc3CCCCCn3c(=O)c21
: