Target
Signal transducer and activator of transcription 1-alpha/beta
Ligand
BDBM42690
Substrate
Meas. Tech.
Dose response counterscreen assay for STAT3 inhibitors: cell-based high throughput assay to measure STAT1 inhibition
IC50
>55700±n/a nM
Citation
 PubChem, PC Dose response counterscreen assay for STAT3 inhibitors: cell-based high throughput assay to measure STAT1 inhibition PubChem Bioassay (2008)[AID] 
Target
Name:
Signal transducer and activator of transcription 1-alpha/beta
Synonyms:
STAT1 Signal transducer and activator of transcription 1-alpha/beta Transcription factor ISGF-3 components p91/p84 | signal transducer and activator of transcription 1 isoform alpha
Type:
Cytosolic Transcription Factor
Mol. Mass.:
87327.69
Organism:
Homo sapiens (Human)
Description:
Stat1 was expressed in sf9 cells from a baculovirus encoding the recombinant proteins. Stat1 dimer binds to DNA.
Residue:
750
  
Inhibitor
Name:
BDBM42690
Synonyms:
1H-indazole-3-carboxylic acid [2-keto-2-(4-pyrrolidinosulfonylanilino)ethyl] ester MLS000057172 [2-oxidanylidene-2-[(4-pyrrolidin-1-ylsulfonylphenyl)amino]ethyl] 1H-indazole-3-carboxylate cid_2377706
Type:
Small organic molecule
Emp. Form.:
C20H20N4O5S
Mol. Mass.:
428.462
SMILES:
O=C(COC(=O)c1n[nH]c2ccccc12)Nc1ccc(cc1)S(=O)(=O)N1CCCC1
: