Target
Signal transducer and activator of transcription 1-alpha/beta
Ligand
BDBM46344
Substrate
Meas. Tech.
Dose response counterscreen assay for STAT3 inhibitors: cell-based high throughput assay to measure STAT1 inhibition
IC50
18260±n/a nM
Citation
 PubChem, PC Dose response counterscreen assay for STAT3 inhibitors: cell-based high throughput assay to measure STAT1 inhibition PubChem Bioassay (2008)[AID] 
Target
Name:
Signal transducer and activator of transcription 1-alpha/beta
Synonyms:
STAT1 Signal transducer and activator of transcription 1-alpha/beta Transcription factor ISGF-3 components p91/p84 | signal transducer and activator of transcription 1 isoform alpha
Type:
Cytosolic Transcription Factor
Mol. Mass.:
87327.69
Organism:
Homo sapiens (Human)
Description:
Stat1 was expressed in sf9 cells from a baculovirus encoding the recombinant proteins. Stat1 dimer binds to DNA.
Residue:
750
  
Inhibitor
Name:
BDBM46344
Synonyms:
MLS000087075 N-(3-hydroxyphenyl)-5-(3-methoxyphenyl)-3-isoxazolecarboxamide SMR000023298 | cid_3243797
Type:
Small organic molecule
Emp. Form.:
C17H14N2O4
Mol. Mass.:
310.3041
SMILES:
COc1cccc(c1)-c1cc(no1)C(=O)Nc1cccc(O)c1
: