Target
Signal transducer and activator of transcription 1-alpha/beta
Ligand
BDBM46346
Substrate
Meas. Tech.
Dose response counterscreen assay for STAT3 inhibitors: cell-based high throughput assay to measure STAT1 inhibition
IC50
>55700±n/a nM
Citation
 PubChem, PC Dose response counterscreen assay for STAT3 inhibitors: cell-based high throughput assay to measure STAT1 inhibition PubChem Bioassay (2008)[AID] 
Target
Name:
Signal transducer and activator of transcription 1-alpha/beta
Synonyms:
STAT1 Signal transducer and activator of transcription 1-alpha/beta Transcription factor ISGF-3 components p91/p84 | signal transducer and activator of transcription 1 isoform alpha
Type:
Cytosolic Transcription Factor
Mol. Mass.:
87327.69
Organism:
Homo sapiens (Human)
Description:
Stat1 was expressed in sf9 cells from a baculovirus encoding the recombinant proteins. Stat1 dimer binds to DNA.
Residue:
750
  
Inhibitor
Name:
BDBM46346
Synonyms:
1-[4-(4-phenylpiperidin-1-yl)sulfonylphenyl]pyrrolidin-2-one 1-[4-[(4-phenyl-1-piperidinyl)sulfonyl]phenyl]-2-pyrrolidinone MLS000099868 cid_1520371
Type:
Small organic molecule
Emp. Form.:
C21H24N2O3S
Mol. Mass.:
384.492
SMILES:
O=C1CCCN1c1ccc(cc1)S(=O)(=O)N1CCC(CC1)c1ccccc1
: