Target
Signal transducer and activator of transcription 1-alpha/beta
Ligand
BDBM46381
Substrate
Meas. Tech.
Dose response counterscreen assay for STAT3 inhibitors: cell-based high throughput assay to measure STAT1 inhibition
IC50
>55700±n/a nM
Citation
 PubChem, PC Dose response counterscreen assay for STAT3 inhibitors: cell-based high throughput assay to measure STAT1 inhibition PubChem Bioassay (2008)[AID] 
Target
Name:
Signal transducer and activator of transcription 1-alpha/beta
Synonyms:
STAT1 Signal transducer and activator of transcription 1-alpha/beta Transcription factor ISGF-3 components p91/p84 | signal transducer and activator of transcription 1 isoform alpha
Type:
Cytosolic Transcription Factor
Mol. Mass.:
87327.69
Organism:
Homo sapiens (Human)
Description:
Stat1 was expressed in sf9 cells from a baculovirus encoding the recombinant proteins. Stat1 dimer binds to DNA.
Residue:
750
  
Inhibitor
Name:
BDBM46381
Synonyms:
2-(5-methyl-1,3-dioxooctahydro-2H-isoindol-2-yl)phenyl benzoate SMR000164189 [2-[5-methyl-1,3-bis(oxidanylidene)-3a,4,5,6,7,7a-hexahydroisoindol-2-yl]phenyl] benzoate benzoic acid [2-(5-methyl-1,3-dioxo-3a,4,5,6,7,7a-hexahydroisoindol-2-yl)phenyl] ester | cid_4983290
Type:
Small organic molecule
Emp. Form.:
C22H21NO4
Mol. Mass.:
363.4064
SMILES:
CC1CCc2c(O)n(c(O)c2C1)-c1ccccc1OC(=O)c1ccccc1
: