Target
Alkaline phosphatase, germ cell type
Ligand
BDBM41884
Substrate
Meas. Tech.
Luminescent assay for HTS discovery of chemical inhibitors of placental alkaline phosphatase confirmation
IC50
1580±n/a nM
Citation
 PubChem, PC Luminescent assay for HTS discovery of chemical inhibitors of placental alkaline phosphatase confirmation PubChem Bioassay (2009)[AID] 
Target
Name:
Alkaline phosphatase, germ cell type
Synonyms:
ALPG ALPPL2 PPBN_HUMAN | placental-like alkaline phosphatase preproprotein
Type:
PROTEIN
Mol. Mass.:
57374.31
Organism:
Homo sapiens (Human)
Description:
ChEMBL_29964
Residue:
532
  
Inhibitor
Name:
BDBM41884
Synonyms:
1-(3,4-dihydroxyphenyl)-2-[1-(4-methylphenyl)tetrazol-5-yl]sulfanylethanone 1-(3,4-dihydroxyphenyl)-2-[[1-(p-tolyl)tetrazol-5-yl]thio]ethanone MLS-0315690.0001 | cid_946537
Type:
Small organic molecule
Emp. Form.:
C16H14N4O3S
Mol. Mass.:
342.372
SMILES:
Cc1ccc(cc1)-n1nnnc1SCC(=O)c1ccc(O)c(O)c1
: