Target
Alkaline phosphatase, germ cell type
Ligand
BDBM46061
Substrate
Meas. Tech.
Luminescent assay for HTS discovery of chemical inhibitors of placental alkaline phosphatase confirmation
IC50
4900±n/a nM
Citation
 PubChem, PC Luminescent assay for HTS discovery of chemical inhibitors of placental alkaline phosphatase confirmation PubChem Bioassay (2009)[AID] 
Target
Name:
Alkaline phosphatase, germ cell type
Synonyms:
ALPG ALPPL2 PPBN_HUMAN | placental-like alkaline phosphatase preproprotein
Type:
PROTEIN
Mol. Mass.:
57374.31
Organism:
Homo sapiens (Human)
Description:
ChEMBL_29964
Residue:
532
  
Inhibitor
Name:
BDBM46061
Synonyms:
1-(3,4-dihydroxyphenyl)-2-[(4-methyl-5-thiophen-2-yl-1,2,4-triazol-3-yl)sulfanyl]ethanone 1-(3,4-dihydroxyphenyl)-2-[[4-methyl-5-(2-thienyl)-1,2,4-triazol-3-yl]thio]ethanone MLS-0297827.0001 | cid_3735808
Type:
Small organic molecule
Emp. Form.:
C15H13N3O3S2
Mol. Mass.:
347.412
SMILES:
Cn1c(SCC(=O)c2ccc(O)c(O)c2)nnc1-c1cccs1
: