Target
E3 ubiquitin-protein ligase XIAP
Ligand
BDBM38667
Substrate
Meas. Tech.
Counter Screen using XIAP-Bir3 of the Chemical Antagonists of IAP-family anti-apoptotic proteins confirmation assay
IC50
>200000±0 nM
Citation
 PubChem, PC Counter Screen using XIAP-Bir3 of the Chemical Antagonists of IAP-family anti-apoptotic proteins confirmation assay PubChem Bioassay (2009)[AID] 
Target
Name:
E3 ubiquitin-protein ligase XIAP
Synonyms:
API3 E3 ubiquitin-protein ligase XIAP Inhibitor of apoptosis protein 3 X-linked inhibitor of apoptosis XIAP | XIAP_HUMAN
Type:
Protein
Mol. Mass.:
56685.27
Organism:
Homo sapiens (Human)
Description:
P98170
Residue:
497
  
Inhibitor
Name:
BDBM38667
Synonyms:
(2R)-2-(1-ketoisoindolin-2-yl)-2-phenyl-acetic acid (2R)-2-(3-oxo-1H-isoindol-2-yl)-2-phenylacetic acid LON-WEI-4d77710c-19 SMR000097535 | cid_5308032
Type:
Small organic molecule
Emp. Form.:
C16H13NO3
Mol. Mass.:
267.2793
SMILES:
OC(=O)[C@H](N1Cc2ccccc2C1=O)c1ccccc1
: