Target
Eukaryotic translation initiation factor 2-alpha kinase 3
Ligand
BDBM46472
Substrate
Meas. Tech.
Dose response cell-based high-throughput screening assay to measure PERK inhibition
EC50
>55700±n/a nM
Citation
 PubChem, PC Dose response cell-based high-throughput screening assay to measure PERK inhibition PubChem Bioassay (2009)[AID] 
Target
Name:
Eukaryotic translation initiation factor 2-alpha kinase 3
Synonyms:
E2AK3_HUMAN HsPEK PERK Pancreatic endoplasmic reticulum kinase (PERK)
Type:
Enzyme
Mol. Mass.:
125190.66
Organism:
Homo sapiens (Human)
Description:
Q9NZJ5
Residue:
1116
  
Inhibitor
Name:
BDBM46472
Synonyms:
5-(3,5-dichlorophenyl)-1-isopropyl-1H-1,2,3,4-tetraazole 5-(3,5-dichlorophenyl)-1-propan-2-yltetrazole MLS000325488 cid_1490179
Type:
Small organic molecule
Emp. Form.:
C10H10Cl2N4
Mol. Mass.:
257.119
SMILES:
CC(C)n1nnnc1-c1cc(Cl)cc(Cl)c1
: