Target
Eukaryotic translation initiation factor 2-alpha kinase 3
Ligand
BDBM46460
Substrate
Meas. Tech.
Counterscreen assay for PERK inhibitors: Dose response cell-based high throughput screening assay to measure inhibition of PERK at 6 hours
EC50
>55700±n/a nM
Citation
 PubChem, PC Counterscreen assay for PERK inhibitors: Dose response cell-based high throughput screening assay to measure inhibition of PERK at 6 hours PubChem Bioassay (2009)[AID] 
Target
Name:
Eukaryotic translation initiation factor 2-alpha kinase 3
Synonyms:
E2AK3_HUMAN HsPEK PERK Pancreatic endoplasmic reticulum kinase (PERK)
Type:
Enzyme
Mol. Mass.:
125190.66
Organism:
Homo sapiens (Human)
Description:
Q9NZJ5
Residue:
1116
  
Inhibitor
Name:
BDBM46460
Synonyms:
(1,1-diketo-1,2-benzothiazol-3-yl)-mesityl-amine 1,1-dioxo-N-(2,4,6-trimethylphenyl)-1,2-benzothiazol-3-amine N-mesityl-1,2-benzisothiazol-3-amine 1,1-dioxide cid_733262
Type:
Small organic molecule
Emp. Form.:
C16H16N2O2S
Mol. Mass.:
300.375
SMILES:
Cc1cc(C)c(N=C2NS(=O)(=O)c3ccccc23)c(C)c1
: