Target
Eukaryotic translation initiation factor 2-alpha kinase 3
Ligand
BDBM46461
Substrate
Meas. Tech.
Counterscreen assay for PERK inhibitors: Dose response cell-based high throughput screening assay to measure inhibition of PERK at 6 hours
EC50
>55700±n/a nM
Citation
 PubChem, PC Counterscreen assay for PERK inhibitors: Dose response cell-based high throughput screening assay to measure inhibition of PERK at 6 hours PubChem Bioassay (2009)[AID] 
Target
Name:
Eukaryotic translation initiation factor 2-alpha kinase 3
Synonyms:
E2AK3_HUMAN HsPEK PERK Pancreatic endoplasmic reticulum kinase (PERK)
Type:
Enzyme
Mol. Mass.:
125190.66
Organism:
Homo sapiens (Human)
Description:
Q9NZJ5
Residue:
1116
  
Inhibitor
Name:
BDBM46461
Synonyms:
1-(2-methylphenyl)-3-(3-pyrrolidin-1-ylpropyl)urea 1-(o-tolyl)-3-(3-pyrrolidinopropyl)urea N-(2-methylphenyl)-N'-[3-(1-pyrrolidinyl)propyl]urea cid_2967096
Type:
Small organic molecule
Emp. Form.:
C15H23N3O
Mol. Mass.:
261.3626
SMILES:
Cc1ccccc1NC(=O)NCCCN1CCCC1
: