Target
Eukaryotic translation initiation factor 2-alpha kinase 3
Ligand
BDBM46466
Substrate
Meas. Tech.
Counterscreen assay for PERK inhibitors: Dose response cell-based high throughput screening assay to measure inhibition of PERK at 6 hours
EC50
>55700±n/a nM
Citation
 PubChem, PC Counterscreen assay for PERK inhibitors: Dose response cell-based high throughput screening assay to measure inhibition of PERK at 6 hours PubChem Bioassay (2009)[AID] 
Target
Name:
Eukaryotic translation initiation factor 2-alpha kinase 3
Synonyms:
E2AK3_HUMAN HsPEK PERK Pancreatic endoplasmic reticulum kinase (PERK)
Type:
Enzyme
Mol. Mass.:
125190.66
Organism:
Homo sapiens (Human)
Description:
Q9NZJ5
Residue:
1116
  
Inhibitor
Name:
BDBM46466
Synonyms:
4-[2-(4-carbomethoxyphenoxy)ethoxy]benzoic acid methyl ester MLS000534819 cid_77875 methyl 4-[2-(4-methoxycarbonylphenoxy)ethoxy]benzoate
Type:
Small organic molecule
Emp. Form.:
C18H18O6
Mol. Mass.:
330.3319
SMILES:
COC(=O)c1ccc(OCCOc2ccc(cc2)C(=O)OC)cc1
: