Target
Eukaryotic translation initiation factor 2-alpha kinase 3
Ligand
BDBM46486
Substrate
Meas. Tech.
Counterscreen assay for PERK inhibitors: Dose response cell-based high throughput screening assay to measure inhibition of PERK at 6 hours
EC50
>55700±n/a nM
Citation
 PubChem, PC Counterscreen assay for PERK inhibitors: Dose response cell-based high throughput screening assay to measure inhibition of PERK at 6 hours PubChem Bioassay (2009)[AID] 
Target
Name:
Eukaryotic translation initiation factor 2-alpha kinase 3
Synonyms:
E2AK3_HUMAN HsPEK PERK Pancreatic endoplasmic reticulum kinase (PERK)
Type:
Enzyme
Mol. Mass.:
125190.66
Organism:
Homo sapiens (Human)
Description:
Q9NZJ5
Residue:
1116
  
Inhibitor
Name:
BDBM46486
Synonyms:
2,2,2-trichloro-N-(mesitylcarbamoyl)acetamide 2,2,2-trichloro-N-[(mesitylamino)carbonyl]acetamide 2,2,2-tris(chloranyl)-N-[(2,4,6-trimethylphenyl)carbamoyl]ethanamide SMR000291961 | cid_888622
Type:
Small organic molecule
Emp. Form.:
C12H13Cl3N2O2
Mol. Mass.:
323.603
SMILES:
Cc1cc(C)c(NC(=O)NC(=O)C(Cl)(Cl)Cl)c(C)c1
: