Target
Eukaryotic translation initiation factor 2-alpha kinase 3
Ligand
BDBM46499
Substrate
Meas. Tech.
Counterscreen assay for PERK inhibitors: Dose response cell-based high throughput screening assay to measure inhibition of PERK at 6 hours
EC50
>55700±n/a nM
Citation
 PubChem, PC Counterscreen assay for PERK inhibitors: Dose response cell-based high throughput screening assay to measure inhibition of PERK at 6 hours PubChem Bioassay (2009)[AID] 
Target
Name:
Eukaryotic translation initiation factor 2-alpha kinase 3
Synonyms:
E2AK3_HUMAN HsPEK PERK Pancreatic endoplasmic reticulum kinase (PERK)
Type:
Enzyme
Mol. Mass.:
125190.66
Organism:
Homo sapiens (Human)
Description:
Q9NZJ5
Residue:
1116
  
Inhibitor
Name:
BDBM46499
Synonyms:
1-[[4-[(carbamothioylhydrazinylidene)methyl]phenyl]methylideneamino]thiourea SMR000304531 [[4-[(carbamothioylhydrazinylidene)methyl]phenyl]methylideneamino]thiourea cid_3781603 | terephthalaldehyde dithiosemicarbazone
Type:
Small organic molecule
Emp. Form.:
C10H12N6S2
Mol. Mass.:
280.372
SMILES:
NC(=S)NN=Cc1ccc(C=NNC(N)=S)cc1
: