Target
Eukaryotic translation initiation factor 2-alpha kinase 3
Ligand
BDBM46504
Substrate
Meas. Tech.
Counterscreen assay for PERK inhibitors: Dose response cell-based high throughput screening assay to measure inhibition of PERK at 6 hours
EC50
>55700±n/a nM
Citation
 PubChem, PC Counterscreen assay for PERK inhibitors: Dose response cell-based high throughput screening assay to measure inhibition of PERK at 6 hours PubChem Bioassay (2009)[AID] 
Target
Name:
Eukaryotic translation initiation factor 2-alpha kinase 3
Synonyms:
E2AK3_HUMAN HsPEK PERK Pancreatic endoplasmic reticulum kinase (PERK)
Type:
Enzyme
Mol. Mass.:
125190.66
Organism:
Homo sapiens (Human)
Description:
Q9NZJ5
Residue:
1116
  
Inhibitor
Name:
BDBM46504
Synonyms:
2-[(4-amino-5-methyl-1,2,4-triazol-3-yl)sulfanyl]-N-(6-methoxy-1,3-benzothiazol-2-yl)acetamide 2-[(4-azanyl-5-methyl-1,2,4-triazol-3-yl)sulfanyl]-N-(6-methoxy-1,3-benzothiazol-2-yl)ethanamide SMR000348034 | cid_2488514
Type:
Small organic molecule
Emp. Form.:
C13H14N6O2S2
Mol. Mass.:
350.419
SMILES:
COc1ccc2nc(NC(=O)CSc3nnc(C)n3N)sc2c1
: