Target
Eukaryotic translation initiation factor 2-alpha kinase 3
Ligand
BDBM46528
Substrate
Meas. Tech.
Counterscreen assay for PERK inhibitors: Dose response cell-based high throughput screening assay to measure inhibition of PERK at 6 hours
EC50
>55700±n/a nM
Citation
 PubChem, PC Counterscreen assay for PERK inhibitors: Dose response cell-based high throughput screening assay to measure inhibition of PERK at 6 hours PubChem Bioassay (2009)[AID] 
Target
Name:
Eukaryotic translation initiation factor 2-alpha kinase 3
Synonyms:
E2AK3_HUMAN HsPEK PERK Pancreatic endoplasmic reticulum kinase (PERK)
Type:
Enzyme
Mol. Mass.:
125190.66
Organism:
Homo sapiens (Human)
Description:
Q9NZJ5
Residue:
1116
  
Inhibitor
Name:
BDBM46528
Synonyms:
4-amino-N'-[(4-nitrobenzylidene)amino]furazan-3-carboxamidine 4-azanyl-N'-[(4-nitrophenyl)methylideneamino]-1,2,5-oxadiazole-3-carboximidamide SMR000427774 | cid_2841377
Type:
Small organic molecule
Emp. Form.:
C10H9N7O3
Mol. Mass.:
275.2236
SMILES:
NC(=N[N-][CH+]c1ccc(cc1)[N+]([O-])=O)c1nonc1N
: