Target
Transitional endoplasmic reticulum ATPase
Ligand
BDBM46572
Substrate
Meas. Tech.
Dose response biochemical high throughput screening assay for inhibitors of the p97 ATPase
IC50
11140±n/a nM
Citation
 PubChem, PC Dose response biochemical high throughput screening assay for inhibitors of the p97 ATPase PubChem Bioassay (2009)[AID] 
Target
Name:
Transitional endoplasmic reticulum ATPase
Synonyms:
TERA_HUMAN VCP Valosin-containing protein
Type:
Enzyme
Mol. Mass.:
89300.63
Organism:
Homo sapiens (Human)
Description:
P55072
Residue:
806
  
Inhibitor
Name:
BDBM46572
Synonyms:
(6E)-5-azanylidene-6-[(4-oxidanylidenechromen-3-yl)methylidene]-2-pyridin-4-yl-[1,3,4]thiadiazolo[3,2-a]pyrimidin-7-one (6E)-5-imino-6-[(4-oxo-1-benzopyran-3-yl)methylidene]-2-pyridin-4-yl-[1,3,4]thiadiazolo[3,2-a]pyrimidin-7-one 5-Imino-6-[1-(4-oxo-4H-chromen-3-yl)-meth-(E)-ylidene]-2-pyridin-4-yl-5,6-dihydro-[1,3,4]thiadiazolo[3,2-a]pyrimidin-7-one SMR000221531 | cid_1976446
Type:
Small organic molecule
Emp. Form.:
C20H11N5O3S
Mol. Mass.:
401.398
SMILES:
N=C1N2N=C(SC2=NC(=O)\C1=C\c1coc2ccccc2c1=O)c1ccncc1
: