Target
Mannose-6-phosphate isomerase
Ligand
BDBM46667
Substrate
Meas. Tech.
Confirmation of compounds inhibiting phosphomannose isomerase (PMI) via a fluorescence intensity assay.
IC50
6650±n/a nM
Citation
 PubChem, PC Confirmation of compounds inhibiting phosphomannose isomerase (PMI) via a fluorescence intensity assay. PubChem Bioassay (2010)[AID] 
Target
Name:
Mannose-6-phosphate isomerase
Synonyms:
MPI MPI_HUMAN PMI1
Type:
PROTEIN
Mol. Mass.:
46651.35
Organism:
Homo sapiens (Human)
Description:
ChEMBL_1448919
Residue:
423
  
Inhibitor
Name:
BDBM46667
Synonyms:
2-phenyl-1,2-benzothiazol-3-one MLS-0107957.0001 cid_164981
Type:
Small organic molecule
Emp. Form.:
C13H9NOS
Mol. Mass.:
227.282
SMILES:
O=c1n(sc2ccccc12)-c1ccccc1
: