Target
Ion channel NompC
Ligand
BDBM46751
Substrate
Meas. Tech.
Dose response cell-based high-throughput screening assay for agonists of the transient receptor potential channel N1 (TRPN1)
EC50
>29900±n/a nM
Citation
 PubChem, PC Dose response cell-based high-throughput screening assay for agonists of the transient receptor potential channel N1 (TRPN1) PubChem Bioassay (2010)[AID] 
Target
Name:
Ion channel NompC
Synonyms:
transient receptor potential cation channel, subfamily N, member 1
Type:
Enzyme Catalytic Domain
Mol. Mass.:
175824.78
Organism:
Danio rerio
Description:
Q7T1G6
Residue:
1614
  
Inhibitor
Name:
BDBM46751
Synonyms:
2-[[5-(methoxymethyl)-4-phenyl-1,2,4-triazol-3-yl]sulfanyl]-N-(phenylmethyl)ethanamide MLS000096711 N-benzyl-2-[[5-(methoxymethyl)-4-phenyl-1,2,4-triazol-3-yl]thio]acetamide SMR000073961 | cid_1313776
Type:
Small organic molecule
Emp. Form.:
C19H20N4O2S
Mol. Mass.:
368.453
SMILES:
COCc1nnc(SCC(=O)NCc2ccccc2)n1-c1ccccc1
: