Target
Ion channel NompC
Ligand
BDBM46766
Substrate
Meas. Tech.
Dose response cell-based high-throughput screening assay for agonists of the transient receptor potential channel N1 (TRPN1)
EC50
>29900±n/a nM
Citation
 PubChem, PC Dose response cell-based high-throughput screening assay for agonists of the transient receptor potential channel N1 (TRPN1) PubChem Bioassay (2010)[AID] 
Target
Name:
Ion channel NompC
Synonyms:
transient receptor potential cation channel, subfamily N, member 1
Type:
Enzyme Catalytic Domain
Mol. Mass.:
175824.78
Organism:
Danio rerio
Description:
Q7T1G6
Residue:
1614
  
Inhibitor
Name:
BDBM46766
Synonyms:
3-[(3,4-dichlorophenyl)carbamoylamino]benzoic acid methyl ester MLS000581944 cid_734388 methyl 3-[(3,4-dichlorophenyl)carbamoylamino]benzoate
Type:
Small organic molecule
Emp. Form.:
C15H12Cl2N2O3
Mol. Mass.:
339.173
SMILES:
COC(=O)c1cccc(NC(=O)Nc2ccc(Cl)c(Cl)c2)c1
: