Target
Ion channel NompC
Ligand
BDBM46768
Substrate
Meas. Tech.
Dose response cell-based high-throughput screening assay for agonists of the transient receptor potential channel N1 (TRPN1)
EC50
>9970±n/a nM
Citation
 PubChem, PC Dose response cell-based high-throughput screening assay for agonists of the transient receptor potential channel N1 (TRPN1) PubChem Bioassay (2010)[AID] 
Target
Name:
Ion channel NompC
Synonyms:
transient receptor potential cation channel, subfamily N, member 1
Type:
Enzyme Catalytic Domain
Mol. Mass.:
175824.78
Organism:
Danio rerio
Description:
Q7T1G6
Residue:
1614
  
Inhibitor
Name:
BDBM46768
Synonyms:
6-(1-piperidinyl)-2-propyl-1H-benzo[de]isoquinoline-1,3(2H)-dione 6-piperidin-1-yl-2-propyl-benzo[de]isoquinoline-1,3-dione 6-piperidino-2-propyl-benzo[de]isoquinoline-1,3-quinone SMR000198218 | cid_2937970
Type:
Small organic molecule
Emp. Form.:
C20H22N2O2
Mol. Mass.:
322.4009
SMILES:
CCCN1C(=O)c2cccc3c(ccc(C1=O)c23)N1CCCCC1
: