Target
Ion channel NompC
Ligand
BDBM46816
Substrate
Meas. Tech.
Dose response cell-based high-throughput screening assay for agonists of the transient receptor potential channel N1 (TRPN1)
EC50
>29900±n/a nM
Citation
 PubChem, PC Dose response cell-based high-throughput screening assay for agonists of the transient receptor potential channel N1 (TRPN1) PubChem Bioassay (2010)[AID] 
Target
Name:
Ion channel NompC
Synonyms:
transient receptor potential cation channel, subfamily N, member 1
Type:
Enzyme Catalytic Domain
Mol. Mass.:
175824.78
Organism:
Danio rerio
Description:
Q7T1G6
Residue:
1614
  
Inhibitor
Name:
BDBM46816
Synonyms:
(E)-2-(cyclopropanecarbonyl)-3-[4-(dimethylamino)phenyl]acrylonitrile (E)-2-[cyclopropyl(oxo)methyl]-3-[4-(dimethylamino)phenyl]-2-propenenitrile 2-(cyclopropylcarbonyl)-3-[4-(dimethylamino)phenyl]acrylonitrile SMR000459249 | cid_5715380
Type:
Small organic molecule
Emp. Form.:
C15H16N2O
Mol. Mass.:
240.3003
SMILES:
CN(C)c1ccc(C=C(C#N)C(=O)C2CC2)cc1
: