Target
Transitional endoplasmic reticulum ATPase
Ligand
BDBM46566
Substrate
Meas. Tech.
Luminescence counterscreen assay for p97 inhibitors: Dose response biochemical high throughput screening assay to identify inhibitors of the C522A mutant p97 ATPase.
IC50
>50000±n/a nM
Citation
 PubChem, PC Luminescence counterscreen assay for p97 inhibitors: Dose response biochemical high throughput screening assay to identify inhibitors of the C522A mutant p97 ATPase. PubChem Bioassay (2009)[AID] 
Target
Name:
Transitional endoplasmic reticulum ATPase
Synonyms:
TERA_HUMAN VCP Valosin-containing protein
Type:
Enzyme
Mol. Mass.:
89300.63
Organism:
Homo sapiens (Human)
Description:
P55072
Residue:
806
  
Inhibitor
Name:
BDBM46566
Synonyms:
MLS000589113 N-(3-besyl-1-butyl-pyrrolo[3,2-b]quinoxalin-2-yl)-4-methyl-benzenesulfonamide N-[3-(benzenesulfonyl)-1-butyl-2-pyrrolo[3,2-b]quinoxalinyl]-4-methylbenzenesulfonamide SMR000219689 | cid_3787408
Type:
Small organic molecule
Emp. Form.:
C27H26N4O4S2
Mol. Mass.:
534.65
SMILES:
CCCCn1c(NS(=O)(=O)c2ccc(C)cc2)c(c2nc3ccccc3nc12)S(=O)(=O)c1ccccc1
: