Target
Mucolipin-3
Ligand
BDBM46820
Substrate
Meas. Tech.
Dose response cell-based high-throughput screening assay for agonists of the transient receptor potential channel ML3 (TRPML3)
EC50
>29900±n/a nM
Citation
 PubChem, PC Dose response cell-based high-throughput screening assay for agonists of the transient receptor potential channel ML3 (TRPML3) PubChem Bioassay (2009)[AID] 
Target
Name:
Mucolipin-3
Synonyms:
MCLN3_HUMAN MCOLN3 protein
Type:
Enzyme Catalytic Domain
Mol. Mass.:
64244.09
Organism:
Homo sapiens (Human)
Description:
Q8TDD5
Residue:
553
  
Inhibitor
Name:
BDBM46820
Synonyms:
5,5-Dimethyl-2-phenyl-3a,4,5,6,7,8,9,9a-octahydro-benzo[f]isoindole-1,3-dione 5,5-dimethyl-2-phenyl-4,6,7,8,9,9a-hexahydro-3aH-benzo[f]isoindole-1,3-dione SMR000012621 | cid_649533
Type:
Small organic molecule
Emp. Form.:
C20H23NO2
Mol. Mass.:
309.4021
SMILES:
CC1(C)CCCC2=C1Cc1c(C2)c(O)n(c1O)-c1ccccc1
: