Target
Mucolipin-3
Ligand
BDBM46836
Substrate
Meas. Tech.
Dose response cell-based high-throughput screening assay for agonists of the transient receptor potential channel ML3 (TRPML3)
EC50
>9990±n/a nM
Citation
 PubChem, PC Dose response cell-based high-throughput screening assay for agonists of the transient receptor potential channel ML3 (TRPML3) PubChem Bioassay (2009)[AID] 
Target
Name:
Mucolipin-3
Synonyms:
MCLN3_HUMAN MCOLN3 protein
Type:
Enzyme Catalytic Domain
Mol. Mass.:
64244.09
Organism:
Homo sapiens (Human)
Description:
Q8TDD5
Residue:
553
  
Inhibitor
Name:
BDBM46836
Synonyms:
1-tert-butyl-3-methyl-4-(phenylsulfonyl)-1H-pyrazol-5-yl cyclopentanecarboxylate SMR000025357 [4-(benzenesulfonyl)-2-tert-butyl-5-methylpyrazol-3-yl] cyclopentanecarboxylate cyclopentanecarboxylic acid (4-besyl-2-tert-butyl-5-methyl-pyrazol-3-yl) ester | cyclopentanecarboxylic acid [4-(benzenesulfonyl)-2-tert-butyl-5-methyl-3-pyrazolyl] ester
Type:
Small organic molecule
Emp. Form.:
C20H26N2O4S
Mol. Mass.:
390.496
SMILES:
Cc1nn(c(OC(=O)C2CCCC2)c1S(=O)(=O)c1ccccc1)C(C)(C)C
: