Target
Mucolipin-3
Ligand
BDBM44578
Substrate
Meas. Tech.
Dose response cell-based high-throughput screening assay for agonists of the transient receptor potential channel ML3 (TRPML3)
EC50
>29900±n/a nM
Citation
 PubChem, PC Dose response cell-based high-throughput screening assay for agonists of the transient receptor potential channel ML3 (TRPML3) PubChem Bioassay (2009)[AID] 
Target
Name:
Mucolipin-3
Synonyms:
MCLN3_HUMAN MCOLN3 protein
Type:
Enzyme Catalytic Domain
Mol. Mass.:
64244.09
Organism:
Homo sapiens (Human)
Description:
Q8TDD5
Residue:
553
  
Inhibitor
Name:
BDBM44578
Synonyms:
1-(5-bromanylthiophen-2-yl)sulfonyl-4-methyl-piperidine 1-[(5-bromo-2-thienyl)sulfonyl]-4-methyl-piperidine 1-[(5-bromo-2-thiophenyl)sulfonyl]-4-methylpiperidine MLS000069556 SMR000058825 cid_15209 | cid_893468
Type:
Small organic molecule
Emp. Form.:
C10H14BrNO2S2
Mol. Mass.:
324.258
SMILES:
CC1CCN(CC1)S(=O)(=O)c1ccc(Br)s1
: