Target
Mucolipin-3
Ligand
BDBM46884
Substrate
Meas. Tech.
Dose response cell-based high-throughput screening assay for agonists of the transient receptor potential channel ML3 (TRPML3)
EC50
3550±n/a nM
Citation
 PubChem, PC Dose response cell-based high-throughput screening assay for agonists of the transient receptor potential channel ML3 (TRPML3) PubChem Bioassay (2009)[AID] 
Target
Name:
Mucolipin-3
Synonyms:
MCLN3_HUMAN MCOLN3 protein
Type:
Enzyme Catalytic Domain
Mol. Mass.:
64244.09
Organism:
Homo sapiens (Human)
Description:
Q8TDD5
Residue:
553
  
Inhibitor
Name:
BDBM46884
Synonyms:
2,3-bis(chloranyl)-N-cyclopentyl-4-methoxy-benzenesulfonamide 2,3-dichloro-N-cyclopentyl-4-methoxybenzenesulfonamide SMR000136604 | cid_893896
Type:
Small organic molecule
Emp. Form.:
C12H15Cl2NO3S
Mol. Mass.:
324.223
SMILES:
COc1ccc(c(Cl)c1Cl)S(=O)(=O)NC1CCCC1
: