Target
Mucolipin-3
Ligand
BDBM46920
Substrate
Meas. Tech.
Dose response cell-based high-throughput screening assay for agonists of the transient receptor potential channel ML3 (TRPML3)
EC50
2760±n/a nM
Citation
 PubChem, PC Dose response cell-based high-throughput screening assay for agonists of the transient receptor potential channel ML3 (TRPML3) PubChem Bioassay (2009)[AID] 
Target
Name:
Mucolipin-3
Synonyms:
MCLN3_HUMAN MCOLN3 protein
Type:
Enzyme Catalytic Domain
Mol. Mass.:
64244.09
Organism:
Homo sapiens (Human)
Description:
Q8TDD5
Residue:
553
  
Inhibitor
Name:
BDBM46920
Synonyms:
MLS000548236 N-[2,6-dimethyl-3-[4-(2-methylprop-2-enyl)piperazin-1-yl]sulfonyl-phenyl]-N,4-dimethyl-benzenesulfonamide N-[2,6-dimethyl-3-[[4-(2-methylprop-2-enyl)-1-piperazinyl]sulfonyl]phenyl]-N,4-dimethylbenzenesulfonamide SMR000172295 | cid_2937394
Type:
Small organic molecule
Emp. Form.:
C24H33N3O4S2
Mol. Mass.:
491.667
SMILES:
CN(c1c(C)ccc(c1C)S(=O)(=O)N1CCN(CC(C)=C)CC1)S(=O)(=O)c1ccc(C)cc1
: